Reaction Details
TargetGlucocorticoid receptor
LigandBDBM50417879
Substrate/Competitorn/a
Meas. Tech.ChEMBL_716758 (CHEMBL1670640)
IC50 5.01±n/a nM
Citation Diallo, HAngell, DCBarnett, HABiggadike, KCoe, DMCooper, TWCraven, AGray, JRHouse, DJack, TIKeeling, SPMacdonald, SJMcLay, IMOliver, STaylor, SJUings, IJWellaway, N Discovery of a potent series of non-steroidal nona-trifluoromethyl carbinol glucocorticoid receptor agonists with reduced lipophilicity. Bioorg Med Chem Lett21:1126-33 (2011) 
 
Glucocorticoid receptor
Name:Glucocorticoid receptor
Type:Enzyme
Mol. Mass.:85656.87
Organism:Homo sapiens (Human)
Description:P04150
Residue:777
BDBM50417879
NameBDBM50417879
Synonyms:CHEMBL1668068
TypeSmall organic molecule
Emp. Form.C27H29N5O2S
Mol. Mass.487.616
SMILESC[C@@H](CNc1cc(C)cc2n(ncc12)-c1ccc(cc1)C#N)NS(=O)(=O)c1c(C)cc(C)cc1C