Reaction Details
TargetGlucocorticoid receptor
LigandBDBM50417898
Substrate/Competitorn/a
Meas. Tech.ChEMBL_716756 (CHEMBL1670638)
IC50 5.01±n/a nM
Citation Diallo, HAngell, DCBarnett, HABiggadike, KCoe, DMCooper, TWCraven, AGray, JRHouse, DJack, TIKeeling, SPMacdonald, SJMcLay, IMOliver, STaylor, SJUings, IJWellaway, N Discovery of a potent series of non-steroidal nona-trifluoromethyl carbinol glucocorticoid receptor agonists with reduced lipophilicity. Bioorg Med Chem Lett21:1126-33 (2011) 
 
Glucocorticoid receptor
Name:Glucocorticoid receptor
Type:Enzyme
Mol. Mass.:85656.87
Organism:Homo sapiens (Human)
Description:P04150
Residue:777
BDBM50417898
NameBDBM50417898
Synonyms:CHEMBL1668088
TypeSmall organic molecule
Emp. Form.C24H30N6O4S
Mol. Mass.498.598
SMILESC[C@@H](CNc1cc(C)cc2n(ncc12)-c1cccc(c1)C(=O)N[C@@H](C)C(N)=O)NS(=O)(=O)C1CC1