Reaction Details
TargetGlucocorticoid receptor
LigandBDBM50417877
Substrate/Competitorn/a
Meas. Tech.ChEMBL_716756 (CHEMBL1670638)
IC50 7.94±n/a nM
Citation Diallo, HAngell, DCBarnett, HABiggadike, KCoe, DMCooper, TWCraven, AGray, JRHouse, DJack, TIKeeling, SPMacdonald, SJMcLay, IMOliver, STaylor, SJUings, IJWellaway, N Discovery of a potent series of non-steroidal nona-trifluoromethyl carbinol glucocorticoid receptor agonists with reduced lipophilicity. Bioorg Med Chem Lett21:1126-33 (2011) 
 
Glucocorticoid receptor
Name:Glucocorticoid receptor
Type:Enzyme
Mol. Mass.:85656.87
Organism:Homo sapiens (Human)
Description:P04150
Residue:777
BDBM50417877
NameBDBM50417877
Synonyms:CHEMBL1668066
TypeSmall organic molecule
Emp. Form.C26H29FN4O2S
Mol. Mass.480.597
SMILESC[C@@H](CNc1cc(C)cc2n(ncc12)-c1cccc(F)c1)NS(=O)(=O)c1c(C)cc(C)cc1C