Reaction Details
Target5-hydroxytryptamine receptor 6
LigandBDBM50417920
Substrate/Competitorn/a
Meas. Tech.ChEMBL_716899 (CHEMBL1670878)
Ki 0.398±n/a nM
Citation Ivachtchenko, AVGolovina, ESKadieva, MGKysil, VMMitkin, ODTkachenko, SEOkun, I Synthesis and SAR of 3-arylsulfonyl-pyrazolo[1,5-a]pyrimidines as potent serotonin 5-HT6 receptor antagonists. Bioorg Med Chem19:1482-91 (2011) 
 
5-hydroxytryptamine receptor 6
Name:5-hydroxytryptamine receptor 6
Type:G Protein-Coupled Receptor (GPCR)
Mol. Mass.:46968.43
Organism:Homo sapiens (Human)
Description:P50406
Residue:440
BDBM50417920
NameBDBM50417920
Synonyms:CHEMBL1668592 | US8829009, 1.1(3)
TypeSmall organic molecule
Emp. Form.C15H15FN4O2S
Mol. Mass.334.369
SMILESCNc1nn2c(C)cc(C)nc2c1S(=O)(=O)c1ccc(F)cc1