Reaction Details
TargetPotassium voltage-gated channel subfamily H member 2
LigandBDBM20607
Substrate/Competitorn/a
Meas. Tech.ChEMBL_725152 (CHEMBL1676103)
IC50 1584.89±n/a nM
Citation Sinha, NSen, S Predicting hERG activities of compounds from their 3D structures: development and evaluation of a global descriptors based QSAR model. Eur J Med Chem46:618-30 (2011) 
 
Potassium voltage-gated channel subfamily H member 2
Name:Potassium voltage-gated channel subfamily H member 2
Type:Multi-pass membrane protein
Mol. Mass.:126672.65
Organism:Homo sapiens (Human)
Description:Q12809
Residue:1159
BDBM20607
NameBDBM20607
Synonyms:(2-{4-[(1Z)-1,2-diphenylbut-1-en-1-yl]phenoxy}ethyl)dimethylamine CHEMBL83 NCGC00024928 Tamoxifen Tamoxifen, 7 med.21724, Compound Tamoxifen
TypeSmall organic molecule
Emp. Form.C26H29NO
Mol. Mass.371.5146
SMILESCC\C(=C(/c1ccccc1)c1ccc(OCCN(C)C)cc1)c1ccccc1