Reaction Details
TargetPotassium voltage-gated channel subfamily H member 2
LigandBDBM50117271
Substrate/Competitorn/a
Meas. Tech.ChEMBL_725152 (CHEMBL1676103)
IC50 10000±n/a nM
Citation Sinha, NSen, S Predicting hERG activities of compounds from their 3D structures: development and evaluation of a global descriptors based QSAR model. Eur J Med Chem46:618-30 (2011) 
 
Potassium voltage-gated channel subfamily H member 2
Name:Potassium voltage-gated channel subfamily H member 2
Type:Multi-pass membrane protein
Mol. Mass.:126672.65
Organism:Homo sapiens (Human)
Description:Q12809
Residue:1159
BDBM50117271
NameBDBM50117271
Synonyms:1-(2,6-dimethylphenoxy)-2-propanolamine 2-(2,6-Dimethyl-phenoxy)-1-methyl-ethylamine CHEMBL558 Mexitil
TypeSmall organic molecule
Emp. Form.C11H17NO
Mol. Mass.179.2588
SMILESCC(N)COc1c(C)cccc1C