Reaction Details
TargetPotassium voltage-gated channel subfamily H member 2
LigandBDBM50131432
Substrate/Competitorn/a
Meas. Tech.ChEMBL_725152 (CHEMBL1676103)
IC50 15.14±n/a nM
Citation Sinha, NSen, S Predicting hERG activities of compounds from their 3D structures: development and evaluation of a global descriptors based QSAR model. Eur J Med Chem46:618-30 (2011) 
 
Potassium voltage-gated channel subfamily H member 2
Name:Potassium voltage-gated channel subfamily H member 2
Type:Multi-pass membrane protein
Mol. Mass.:126672.65
Organism:Homo sapiens (Human)
Description:Q12809
Residue:1159
BDBM50131432
NameBDBM50131432
Synonyms:CHEMBL533 IBUTILIDE N-{4-[4-(Ethyl-heptyl-amino)-1-hydroxy-butyl]-phenyl}-methanesulfonamide
TypeSmall organic molecule
Emp. Form.C20H36N2O3S
Mol. Mass.384.576
SMILESCCCCCCCN(CC)CCCC(O)c1ccc(NS(C)(=O)=O)cc1