Reaction Details
TargetPotassium voltage-gated channel subfamily H member 2
LigandBDBM22985
Substrate/Competitorn/a
Meas. Tech.ChEMBL_725152 (CHEMBL1676103)
IC50 2511.89±n/a nM
Citation Sinha, NSen, S Predicting hERG activities of compounds from their 3D structures: development and evaluation of a global descriptors based QSAR model. Eur J Med Chem46:618-30 (2011) 
 
Potassium voltage-gated channel subfamily H member 2
Name:Potassium voltage-gated channel subfamily H member 2
Type:Multi-pass membrane protein
Mol. Mass.:126672.65
Organism:Homo sapiens (Human)
Description:Q12809
Residue:1159
BDBM22985
NameBDBM22985
Synonyms:Aralen CHLOROQUINE PHOSPHATE Chloroquine med.21724, Compound 8 | {4-[(7-chloroquinolin-4-yl)amino]pentyl}diethylamine
TypeAntimalarial
Emp. Form.C18H26ClN3
Mol. Mass.319.872
SMILESCCN(CC)CCCC(C)Nc1ccnc2cc(Cl)ccc12