Reaction Details
TargetDipeptidyl peptidase 1
LigandBDBM50417996
Substrate/Competitorn/a
Meas. Tech.ChEMBL_719162 (CHEMBL1679621)
IC50 2±n/a nM
Citation Lainé, DPalovich, MMcCleland, BPetitjean, EDelhom, IXie, HDeng, JLin, GDavis, RJolit, ANevins, NZhao, BVilla, JSchneck, JMcDevitt, PMidgett, RKmett, CUmbrecht, SPeck, BDavis, ABBettoun, D Discovery of novel cyanamide-based inhibitors of cathepsin C. ACS Med Chem Lett2:142-147 (2011) 
 
Dipeptidyl peptidase 1
Name:Dipeptidyl peptidase 1
Type:Enzyme
Mol. Mass.:51857.28
Organism:Homo sapiens (Human)
Description:P53634
Residue:463
BDBM50417996
NameBDBM50417996
Synonyms:CHEMBL1672434
TypeSmall organic molecule
Emp. Form.C12H13Br2N3O2S
Mol. Mass.423.124
SMILESC[C@H]1C[C@H](CN1C#N)NS(=O)(=O)c1cc(Br)ccc1Br