Reaction Details
TargetPotassium voltage-gated channel subfamily H member 2
LigandBDBM50418012
Substrate/Competitorn/a
Meas. Tech.ChEMBL_728053 (CHEMBL1686924)
Ki 31622.78±n/a nM
Citation Kiyoi, TAdam, JMClark, JKDavies, KEasson, AMEdwards, DFeilden, HFields, RFrancis, SJeremiah, FMcArthur, DMorrison, AJProsser, ARatcliffe, PDSchulz, JWishart, GBaker, JCampbell, RCottney, JEDeehan, MEpemolu, OEvans, L Discovery of potent and orally bioavailable heterocycle-based cannabinoid CB1 receptor agonists. Bioorg Med Chem Lett21:1748-53 (2011) 
 
Potassium voltage-gated channel subfamily H member 2
Name:Potassium voltage-gated channel subfamily H member 2
Type:Multi-pass membrane protein
Mol. Mass.:126672.65
Organism:Homo sapiens (Human)
Description:Q12809
Residue:1159
BDBM50418012
NameBDBM50418012
Synonyms:CHEMBL1682272
TypeSmall organic molecule
Emp. Form.C20H24ClN5O3
Mol. Mass.417.889
SMILESCN(CC(N)=O)Cc1nc(no1)-c1cn(CC2CCOCC2)c2c(Cl)cccc12