Reaction Details
TargetCannabinoid receptor 1
LigandBDBM50418020
Substrate/Competitorn/a
Meas. Tech.ChEMBL_728033 (CHEMBL1686904)
EC50 398.11±n/a nM
Citation Kiyoi, TAdam, JMClark, JKDavies, KEasson, AMEdwards, DFeilden, HFields, RFrancis, SJeremiah, FMcArthur, DMorrison, AJProsser, ARatcliffe, PDSchulz, JWishart, GBaker, JCampbell, RCottney, JEDeehan, MEpemolu, OEvans, L Discovery of potent and orally bioavailable heterocycle-based cannabinoid CB1 receptor agonists. Bioorg Med Chem Lett21:1748-53 (2011) 
 
Cannabinoid receptor 1
Name:Cannabinoid receptor 1
Type:G Protein-Coupled Receptor (GPCR)
Mol. Mass.:52868.96
Organism:Homo sapiens (Human)
Description:P21554
Residue:472
BDBM50418020
NameBDBM50418020
Synonyms:CHEMBL1682266
TypeSmall organic molecule
Emp. Form.C24H29ClN6O3S
Mol. Mass.517.043
SMILESNC(=O)CNC(=O)[C@@H]1CCCN1Cc1nc(ns1)-c1cn(CC2CCOCC2)c2c(Cl)cccc12