Reaction Details
TargetHistamine H4 receptor
LigandBDBM7966
Substrate/Competitorn/a
Meas. Tech.ChEMBL_735234 (CHEMBL1694496)
Ki 12.02±n/a nM
Citation Wijtmans, Mde Graaf, Cde Kloe, GIstyastono, EPSmit, JLim, HBoonnak, RNijmeijer, SSmits, RAJongejan, AZuiderveld, Ode Esch, IJLeurs, R Triazole ligands reveal distinct molecular features that induce histamine H4 receptor affinity and subtly govern H4/H3 subtype selectivity. J Med Chem54:1693-703 (2011) 
 
Histamine H4 receptor
Name:Histamine H4 receptor
Type:G Protein-Coupled Receptor (GPCR)
Mol. Mass.:44517.02
Organism:Homo sapiens (Human)
Description:Binding assays were using CHO cells stably expressing hH4R receptors.
Residue:390
BDBM7966
NameBDBM7966
Synonyms:2-(1H-imidazol-4-yl)ethan-1-amine CHEMBL90 Ergotidine Histamine Peremin | [3H]histamine
TypeSmall organic molecule
Emp. Form.C5H9N3
Mol. Mass.111.1451
SMILESNCCc1cnc[nH]1