Reaction Details
TargetHistamine H4 receptor
LigandBDBM50414391
Substrate/Competitorn/a
Meas. Tech.ChEMBL_735239 (CHEMBL1694501)
Ki 1.58±n/a nM
Citation Wijtmans, Mde Graaf, Cde Kloe, GIstyastono, EPSmit, JLim, HBoonnak, RNijmeijer, SSmits, RAJongejan, AZuiderveld, Ode Esch, IJLeurs, R Triazole ligands reveal distinct molecular features that induce histamine H4 receptor affinity and subtly govern H4/H3 subtype selectivity. J Med Chem54:1693-703 (2011) 
 
Histamine H4 receptor
Name:Histamine H4 receptor
Type:G Protein-Coupled Receptor (GPCR)
Mol. Mass.:44517.02
Organism:Homo sapiens (Human)
Description:Binding assays were using CHO cells stably expressing hH4R receptors.
Residue:390
BDBM50414391
NameBDBM50414391
Synonyms:CHEMBL1202332 | CHEMBL553423
TypeSmall organic molecule
Emp. Form.C14H16Cl2N4S
Mol. Mass.343.275
SMILESNC(SCCCc1cnc[nH]1)=NCc1ccc(Cl)c(Cl)c1