Reaction Details
TargetHistamine H3 receptor
LigandBDBM50418065
Substrate/Competitorn/a
Meas. Tech.ChEMBL_735233 (CHEMBL1694495)
Ki 112.2±n/a nM
Citation Wijtmans, Mde Graaf, Cde Kloe, GIstyastono, EPSmit, JLim, HBoonnak, RNijmeijer, SSmits, RAJongejan, AZuiderveld, Ode Esch, IJLeurs, R Triazole ligands reveal distinct molecular features that induce histamine H4 receptor affinity and subtly govern H4/H3 subtype selectivity. J Med Chem54:1693-703 (2011) 
 
Histamine H3 receptor
Name:Histamine H3 receptor
Type:G Protein-Coupled Receptor (GPCR)
Mol. Mass.:48691.47
Organism:Homo sapiens (Human)
Description:Binding assays were using CHO cells stably expressing hH3R receptors.
Residue:445
BDBM50418065
NameBDBM50418065
Synonyms:CHEMBL1688975
TypeSmall organic molecule
Emp. Form.C16H25N5
Mol. Mass.287.4032
SMILESC(Cc1cnc[nH]1)Cn1cc(CC2CCCCCC2)nn1