Reaction Details
TargetCytochrome P450 2C8
LigandBDBM81939
Substrate/Competitorn/a
Meas. Tech.ChEMBL_738492 (CHEMBL1743393)
Ki 17500±n/a nM
Citation Fontana, EDansette, PMPoli, SM Cytochrome p450 enzymes mechanism based inhibitors: common sub-structures and reactivity. Curr Drug Metab6:413-54 (2005) Cytochrome P450 2C8
Name:Cytochrome P450 2C8
Type:Protein
Mol. Mass.:55839.23
Organism:Homo sapiens (Human)
Description:P10632
Residue:490
BDBM81939
NameBDBM81939
Synonyms:CAS_52-53-9 VERAPAMIL
TypeSmall organic molecule
Emp. Form.C27H38N2O4
Mol. Mass.454.6016
SMILESCOc1ccc(CCN(C)CCCC(C#N)(C(C)C)c2ccc(OC)c(OC)c2)cc1OC