Reaction Details
TargetCytochrome P450 2C8
LigandBDBM50105417
Substrate/Competitorn/a
Meas. Tech.ChEMBL_738492 (CHEMBL1743393)
Ki 1200±n/a nM
Citation Fontana, EDansette, PMPoli, SM Cytochrome p450 enzymes mechanism based inhibitors: common sub-structures and reactivity. Curr Drug Metab6:413-54 (2005) Cytochrome P450 2C8
Name:Cytochrome P450 2C8
Type:Protein
Mol. Mass.:55839.23
Organism:Homo sapiens (Human)
Description:P10632
Residue:490
BDBM50105417
NameBDBM50105417
Synonyms:CHEMBL1089 PHENELZINE | Phenethyl-hydrazine
TypeSmall organic molecule
Emp. Form.C8H12N2
Mol. Mass.136.1943
SMILESNNCCc1ccccc1