Reaction Details
TargetCytochrome P450 1A1
LigandBDBM50027779
Substrate/Competitorn/a
Meas. Tech.ChEMBL_774160 (CHEMBL1908255)
Ki 10±n/a nM
Citation Fontana, EDansette, PMPoli, SM Cytochrome p450 enzymes mechanism based inhibitors: common sub-structures and reactivity. Curr Drug Metab6:413-54 (2005) Cytochrome P450 1A1
Name:Cytochrome P450 1A1
Type:PROTEIN
Mol. Mass.:59401.56
Organism:Rattus norvegicus
Description:ChEMBL_774160
Residue:524
BDBM50027779
NameBDBM50027779
Synonyms:4-Ethynyl Pyrene | CHEMBL1908231
TypeSmall organic molecule
Emp. Form.C18H10
Mol. Mass.226.272
SMILESC#Cc1cc2cccc3ccc4cccc1c4c23