Reaction Details
TargetCytochrome P450 1A1
LigandBDBM50027792
Substrate/Competitorn/a
Meas. Tech.ChEMBL_774160 (CHEMBL1908255)
Ki 540±n/a nM
Citation Fontana, EDansette, PMPoli, SM Cytochrome p450 enzymes mechanism based inhibitors: common sub-structures and reactivity. Curr Drug Metab6:413-54 (2005) Cytochrome P450 1A1
Name:Cytochrome P450 1A1
Type:PROTEIN
Mol. Mass.:59401.56
Organism:Rattus norvegicus
Description:ChEMBL_774160
Residue:524
BDBM50027792
NameBDBM50027792
Synonyms:CHEMBL1908223
TypeSmall organic molecule
Emp. Form.C12H14
Mol. Mass.158.2396
SMILESCC#CCCCc1ccccc1