Reaction Details
TargetCytochrome P450 1A1
LigandBDBM50027788
Substrate/Competitorn/a
Meas. Tech.ChEMBL_774160 (CHEMBL1908255)
Ki 8600±n/a nM
Citation Fontana, EDansette, PMPoli, SM Cytochrome p450 enzymes mechanism based inhibitors: common sub-structures and reactivity. Curr Drug Metab6:413-54 (2005) Cytochrome P450 1A1
Name:Cytochrome P450 1A1
Type:PROTEIN
Mol. Mass.:59401.56
Organism:Rattus norvegicus
Description:ChEMBL_774160
Residue:524
BDBM50027788
NameBDBM50027788
Synonyms:4-Ethynyl Acetanilide | CHEMBL1908220
TypeSmall organic molecule
Emp. Form.C10H9NO
Mol. Mass.159.1846
SMILESCC(=O)Nc1ccc(cc1)C#C