Reaction Details
TargetCytochrome P450 2E1
LigandBDBM50027781
Substrate/Competitorn/a
Meas. Tech.ChEMBL_774177 (CHEMBL1908272)
Ki 188000±n/a nM
Citation Fontana, EDansette, PMPoli, SM Cytochrome p450 enzymes mechanism based inhibitors: common sub-structures and reactivity. Curr Drug Metab6:413-54 (2005) Cytochrome P450 2E1
Name:Cytochrome P450 2E1
Type:Enzyme
Mol. Mass.:56637.32
Organism:Rattus norvegicus (rat)
Description:CYP2E1 prepared from rat liver microsomes was used in enzyme assays.
Residue:493
BDBM50027781
NameBDBM50027781
Synonyms:Diallylsulfone
TypeSmall organic molecule
Emp. Form.C6H10O2S
Mol. Mass.146.207
SMILESC=CCS(=O)(=O)CC=C