Reaction Details
TargetCytochrome P450 2E1
LigandBDBM50310823
Substrate/Competitorn/a
Meas. Tech.ChEMBL_738342 (CHEMBL1743419)
Ki 40000±n/a nM
Citation Fontana, EDansette, PMPoli, SM Cytochrome p450 enzymes mechanism based inhibitors: common sub-structures and reactivity. Curr Drug Metab6:413-54 (2005) Cytochrome P450 2E1
Name:Cytochrome P450 2E1
Type:Enzyme
Mol. Mass.:56860.34
Organism:Homo sapiens (Human)
Description:P05181
Residue:493
BDBM50310823
NameBDBM50310823
Synonyms:CHEMBL1078442 | bergamottin
TypeSmall organic molecule
Emp. Form.C21H22O4
Mol. Mass.338.397
SMILES[#6]\[#6](-[#6])=[#6]\[#6]-[#6]\[#6](-[#6])=[#6]\[#6]-[#8]-c1c2ccoc2cc2oc(=O)ccc12