Reaction Details
TargetCytochrome P450 2B6
LigandBDBM20607
Substrate/Competitorn/a
Meas. Tech.ChEMBL_738477 (CHEMBL1743378)
Ki 900±n/a nM
Citation Fontana, EDansette, PMPoli, SM Cytochrome p450 enzymes mechanism based inhibitors: common sub-structures and reactivity. Curr Drug Metab6:413-54 (2005) Cytochrome P450 2B6
Name:Cytochrome P450 2B6
Type:Protein
Mol. Mass.:56289.75
Organism:Homo sapiens (Human)
Description:P20813
Residue:491
BDBM20607
NameBDBM20607
Synonyms:(2-{4-[(1Z)-1,2-diphenylbut-1-en-1-yl]phenoxy}ethyl)dimethylamine CHEMBL83 NCGC00024928 Tamoxifen Tamoxifen, 7 med.21724, Compound Tamoxifen
TypeSmall organic molecule
Emp. Form.C26H29NO
Mol. Mass.371.5146
SMILESCC\C(=C(/c1ccccc1)c1ccc(OCCN(C)C)cc1)c1ccccc1