Reaction Details
TargetCytochrome P450 2B6
LigandBDBM85509
Substrate/Competitorn/a
Meas. Tech.ChEMBL_738479 (CHEMBL1743380)
Ki 200±n/a nM
Citation Fontana, EDansette, PMPoli, SM Cytochrome p450 enzymes mechanism based inhibitors: common sub-structures and reactivity. Curr Drug Metab6:413-54 (2005) Cytochrome P450 2B6
Name:Cytochrome P450 2B6
Type:Protein
Mol. Mass.:56289.75
Organism:Homo sapiens (Human)
Description:P20813
Residue:491
BDBM85509
NameBDBM85509
Synonyms:CAS_55142-85-3 Ticlopidine
TypeSmall organic molecule
Emp. Form.C14H14ClNS
Mol. Mass.263.786
SMILESClc1ccccc1CN1CCc2sccc2C1