Reaction Details
TargetCytochrome P450 2C8
LigandBDBM30130
Substrate/Competitorn/a
Meas. Tech.ChEMBL_738492 (CHEMBL1743393)
Ki 294000±n/a nM
Citation Fontana, EDansette, PMPoli, SM Cytochrome p450 enzymes mechanism based inhibitors: common sub-structures and reactivity. Curr Drug Metab6:413-54 (2005) Cytochrome P450 2C8
Name:Cytochrome P450 2C8
Type:Protein
Mol. Mass.:55839.23
Organism:Homo sapiens (Human)
Description:P10632
Residue:490
BDBM30130
NameBDBM30130
Synonyms:CHEMBL1201082 Fluoxetin Prozac cid_62857
TypeSmall organic molecule
Emp. Form.C17H18F3NO
Mol. Mass.309.3261
SMILESCNCCC(Oc1ccc(cc1)C(F)(F)F)c1ccccc1