Reaction Details
TargetCytochrome P450 3A4
LigandBDBM50241524
Substrate/Competitorn/a
Meas. Tech.ChEMBL_738355 (CHEMBL1743432)
Ki 177±n/a nM
Citation Fontana, EDansette, PMPoli, SM Cytochrome p450 enzymes mechanism based inhibitors: common sub-structures and reactivity. Curr Drug Metab6:413-54 (2005) Cytochrome P450 3A4
Name:Cytochrome P450 3A4
Type:Enzyme
Mol. Mass.:57349.57
Organism:Homo sapiens (Human)
Description:n/a
Residue:503
BDBM50241524
NameBDBM50241524
Synonyms:(-)-deoxypodorhizone CHEMBL471067
TypeSmall organic molecule
Emp. Form.C22H24O7
Mol. Mass.400.4218
SMILESCOc1cc(C[C@@H]2[C@@H](Cc3ccc4OCOc4c3)COC2=O)cc(OC)c1OC