Reaction Details
TargetCytochrome P450 3A4
LigandBDBM50418091
Substrate/Competitorn/a
Meas. Tech.ChEMBL_738360 (CHEMBL1743437)
Ki 399±n/a nM
Citation Fontana, EDansette, PMPoli, SM Cytochrome p450 enzymes mechanism based inhibitors: common sub-structures and reactivity. Curr Drug Metab6:413-54 (2005) Cytochrome P450 3A4
Name:Cytochrome P450 3A4
Type:Enzyme
Mol. Mass.:57349.57
Organism:Homo sapiens (Human)
Description:n/a
Residue:503
BDBM50418091
NameBDBM50418091
Synonyms:CHEMBL404875
TypeSmall organic molecule
Emp. Form.C30H32O9
Mol. Mass.536.5697
SMILESCOc1cc2[C@H](OC(=O)c3ccccc3)[C@@](C)(O)[C@@H](C)Cc3cc4OCOc4c(OC)c3-c2c(OC)c1OC