Reaction Details
TargetCytochrome P450 3A4
LigandBDBM50418095
Substrate/Competitorn/a
Meas. Tech.ChEMBL_738373 (CHEMBL1743450)
Ki 240±n/a nM
Citation Fontana, EDansette, PMPoli, SM Cytochrome p450 enzymes mechanism based inhibitors: common sub-structures and reactivity. Curr Drug Metab6:413-54 (2005) Cytochrome P450 3A4
Name:Cytochrome P450 3A4
Type:Enzyme
Mol. Mass.:57349.57
Organism:Homo sapiens (Human)
Description:n/a
Residue:503
BDBM50418095
NameBDBM50418095
Synonyms:CHEMBL1743352
TypeSmall organic molecule
Emp. Form.C31H38FN5O5S
Mol. Mass.611.727
SMILESCC(C)CN(CC(=O)[C@@H](Cc1ccccc1)NC(=O)CNC(=O)CNCc1cccc(F)c1)S(=O)(=O)c1cccc(N)c1