Reaction Details
TargetCytochrome P450 1A1
LigandBDBM50247221
Substrate/Competitorn/a
Meas. Tech.ChEMBL_738444 (CHEMBL1743521)
Ki 90±n/a nM
Citation Fontana, EDansette, PMPoli, SM Cytochrome p450 enzymes mechanism based inhibitors: common sub-structures and reactivity. Curr Drug Metab6:413-54 (2005) Cytochrome P450 1A1
Name:Cytochrome P450 1A1
Type:Protein
Mol. Mass.:58177.23
Organism:Homo sapiens (Human)
Description:P04798
Residue:512
BDBM50247221
NameBDBM50247221
Synonyms:5-(3,4-dimethoxystyryl)benzene-1,3-diol | CHEMBL473518
TypeSmall organic molecule
Emp. Form.C16H16O4
Mol. Mass.272.2958
SMILESCOc1ccc(\C=C\c2cc(O)cc(O)c2)cc1OC