Reaction Details
TargetCytochrome P450 3A4
LigandBDBM577
Substrate/Competitorn/a
Meas. Tech.ChEMBL_738395 (CHEMBL1743472)
Ki 260±n/a nM
Citation Fontana, EDansette, PMPoli, SM Cytochrome p450 enzymes mechanism based inhibitors: common sub-structures and reactivity. Curr Drug Metab6:413-54 (2005) Cytochrome P450 3A4
Name:Cytochrome P450 3A4
Type:Enzyme
Mol. Mass.:57349.57
Organism:Homo sapiens (Human)
Description:n/a
Residue:503
BDBM577
NameBDBM577
Synonyms:(3S)-oxolan-3-yl N-[(2S,3R)-4-[(4-aminobenzene)(2-methylpropyl)sulfonamido]-3-hydroxy-1-phenylbutan-2-yl]carbamate APV Amprenavir CHEMBL116 | VX-478
TypeSmall organic molecule
Emp. Form.C25H35N3O6S
Mol. Mass.505.627
SMILESCC(C)CN(C[C@@H](O)[C@H](Cc1ccccc1)NC(=O)O[C@H]1CCOC1)S(=O)(=O)c1ccc(N)cc1