Reaction Details
TargetAmine oxidase [flavin-containing] A
LigandBDBM50273561
Substrate/Competitorn/a
Meas. Tech.ChEMBL_739780 (CHEMBL1763606)
Ki 43954161.54±n/a nM
Citation Shelke, SMBhosale, SHDash, RCSuryawanshi, MRMahadik, KR Exploration of new scaffolds as potential MAO-A inhibitors using pharmacophore and 3D-QSAR based in silico screening. Bioorg Med Chem Lett21:2419-24 (2011) 
 
Amine oxidase [flavin-containing] A
Name:Amine oxidase [flavin-containing] A
Type:Protein
Mol. Mass.:59689.53
Organism:Homo sapiens (Human)
Description:P21397
Residue:527
BDBM50273561
NameBDBM50273561
Synonyms:CHEMBL459336 | N-Methyl,N-(3-phenylpropyl)-1-methyl-1H-indole-2-carboxamide
TypeSmall organic molecule
Emp. Form.C20H22N2O
Mol. Mass.306.4015
SMILESCN(CCCc1ccccc1)C(=O)c1cc2ccccc2n1C