Reaction Details
TargetPeroxisome proliferator-activated receptor delta
LigandBDBM50418134
Substrate/Competitorn/a
Meas. Tech.ChEMBL_741371 (CHEMBL1764897)
IC50 25±n/a nM
Citation Evans, KAShearer, BGWisnoski, DDShi, DSparks, SMSternbach, DDWinegar, DABillin, ANBritt, CWay, JMEpperly, AHLeesnitzer, LMMerrihew, RVXu, RXLambert, MHJin, J Phenoxyacetic acids as PPARd partial agonists: synthesis, optimization, and in vivo efficacy. Bioorg Med Chem Lett21:2345-50 (2011) 
 
Peroxisome proliferator-activated receptor delta
Name:Peroxisome proliferator-activated receptor delta
Type:Enzyme
Mol. Mass.:49910.45
Organism:Homo sapiens (Human)
Description:Q03181
Residue:441
BDBM50418134
NameBDBM50418134
Synonyms:CHEMBL1760273
TypeSmall organic molecule
Emp. Form.C28H32ClNO5S
Mol. Mass.530.075
SMILESCCCCN(c1cccc(c1C)-c1ccc(Cl)cc1)S(=O)(=O)c1ccc(O[C@H](C)C(O)=O)c(C)c1C