Reaction Details
TargetPeroxisome proliferator-activated receptor delta
LigandBDBM50418159
Substrate/Competitorn/a
Meas. Tech.ChEMBL_741371 (CHEMBL1764897)
IC50 126±n/a nM
Citation Evans, KAShearer, BGWisnoski, DDShi, DSparks, SMSternbach, DDWinegar, DABillin, ANBritt, CWay, JMEpperly, AHLeesnitzer, LMMerrihew, RVXu, RXLambert, MHJin, J Phenoxyacetic acids as PPARd partial agonists: synthesis, optimization, and in vivo efficacy. Bioorg Med Chem Lett21:2345-50 (2011) 
 
Peroxisome proliferator-activated receptor delta
Name:Peroxisome proliferator-activated receptor delta
Type:Enzyme
Mol. Mass.:49910.45
Organism:Homo sapiens (Human)
Description:Q03181
Residue:441
BDBM50418159
NameBDBM50418159
Synonyms:CHEMBL1760422
TypeSmall organic molecule
Emp. Form.C28H31Cl2NO5S
Mol. Mass.564.52
SMILESCCCCN(c1cccc(c1C)-c1ccc(Cl)c(Cl)c1)S(=O)(=O)c1ccc(OC(C)C(O)=O)c(C)c1C