Reaction Details
TargetPeroxisome proliferator-activated receptor delta
LigandBDBM50418123
Substrate/Competitorn/a
Meas. Tech.ChEMBL_741371 (CHEMBL1764897)
IC50 16±n/a nM
Citation Evans, KAShearer, BGWisnoski, DDShi, DSparks, SMSternbach, DDWinegar, DABillin, ANBritt, CWay, JMEpperly, AHLeesnitzer, LMMerrihew, RVXu, RXLambert, MHJin, J Phenoxyacetic acids as PPARd partial agonists: synthesis, optimization, and in vivo efficacy. Bioorg Med Chem Lett21:2345-50 (2011) 
 
Peroxisome proliferator-activated receptor delta
Name:Peroxisome proliferator-activated receptor delta
Type:Enzyme
Mol. Mass.:49910.45
Organism:Homo sapiens (Human)
Description:Q03181
Residue:441
BDBM50418123
NameBDBM50418123
Synonyms:CHEMBL1760005
TypeSmall organic molecule
Emp. Form.C28H29ClF3NO6S
Mol. Mass.600.046
SMILESCCCCN(c1cccc(-c2ccc(OC(F)(F)F)cc2)c1Cl)S(=O)(=O)c1ccc(OC(C)C(O)=O)c(C)c1C