Reaction Details
TargetPeroxisome proliferator-activated receptor delta
LigandBDBM50418124
Substrate/Competitorn/a
Meas. Tech.ChEMBL_741371 (CHEMBL1764897)
IC50 6.3±n/a nM
Citation Evans, KAShearer, BGWisnoski, DDShi, DSparks, SMSternbach, DDWinegar, DABillin, ANBritt, CWay, JMEpperly, AHLeesnitzer, LMMerrihew, RVXu, RXLambert, MHJin, J Phenoxyacetic acids as PPARd partial agonists: synthesis, optimization, and in vivo efficacy. Bioorg Med Chem Lett21:2345-50 (2011) 
 
Peroxisome proliferator-activated receptor delta
Name:Peroxisome proliferator-activated receptor delta
Type:Enzyme
Mol. Mass.:49910.45
Organism:Homo sapiens (Human)
Description:Q03181
Residue:441
BDBM50418124
NameBDBM50418124
Synonyms:CHEMBL1760428
TypeSmall organic molecule
Emp. Form.C28H29ClF3NO5S
Mol. Mass.584.047
SMILESCCCCN(c1cccc(-c2ccc(cc2)C(F)(F)F)c1Cl)S(=O)(=O)c1ccc(OC(C)C(O)=O)c(C)c1C