Reaction Details
TargetInhibitor of nuclear factor kappa-B kinase subunit alpha
LigandBDBM50418165
Substrate/Competitorn/a
Meas. Tech.ChEMBL_741020 (CHEMBL1764206)
IC50 1995.26±n/a nM
Citation Miller, DDBamborough, PChristopher, JABaldwin, IRChampigny, ACCutler, GJKerns, JKLongstaff, TMellor, GWMorey, JVMorse, MANie, HRumsey, WLTaggart, JJ 3,5-Disubstituted-indole-7-carboxamides: the discovery of a novel series of potent, selective inhibitors of IKK-ß. Bioorg Med Chem Lett21:2255-8 (2011) 
 
Inhibitor of nuclear factor kappa-B kinase subunit alpha
Name:Inhibitor of nuclear factor kappa-B kinase subunit alpha
Type:PROTEIN
Mol. Mass.:84642.21
Organism:Homo sapiens (Human)
Description:ChEMBL_327453
Residue:745
BDBM50418165
NameBDBM50418165
Synonyms:CHEMBL1761512
TypeSmall organic molecule
Emp. Form.C23H27N3O3S
Mol. Mass.425.544
SMILESCCCS(=O)(=O)N1CCC(CC1)c1c[nH]c2c(cc(cc12)-c1ccccc1)C(N)=O