Reaction Details
TargetSerine/threonine-protein kinase TBK1
LigandBDBM50418163
Substrate/Competitorn/a
Meas. Tech.ChEMBL_741024 (CHEMBL1764210)
IC50>3162.28±n/a nM
Citation Miller, DDBamborough, PChristopher, JABaldwin, IRChampigny, ACCutler, GJKerns, JKLongstaff, TMellor, GWMorey, JVMorse, MANie, HRumsey, WLTaggart, JJ 3,5-Disubstituted-indole-7-carboxamides: the discovery of a novel series of potent, selective inhibitors of IKK-ß. Bioorg Med Chem Lett21:2255-8 (2011) 
 
Serine/threonine-protein kinase TBK1
Name:Serine/threonine-protein kinase TBK1
Type:protein
Mol. Mass.:83645.20
Organism:Homo sapiens (Human)
Description:Q9UHD2
Residue:729
BDBM50418163
NameBDBM50418163
Synonyms:CHEMBL1761510
TypeSmall organic molecule
Emp. Form.C20H21N3O
Mol. Mass.319.4002
SMILESNC(=O)c1cc(cc2c(c[nH]c12)C1CCCNC1)-c1ccccc1