Reaction Details
TargetInhibitor of nuclear factor kappa-B kinase subunit beta
LigandBDBM42616
Substrate/Competitorn/a
Meas. Tech.ChEMBL_741019 (CHEMBL1764205)
IC50 2511.89±n/a nM
Citation Miller, DDBamborough, PChristopher, JABaldwin, IRChampigny, ACCutler, GJKerns, JKLongstaff, TMellor, GWMorey, JVMorse, MANie, HRumsey, WLTaggart, JJ 3,5-Disubstituted-indole-7-carboxamides: the discovery of a novel series of potent, selective inhibitors of IKK-ß. Bioorg Med Chem Lett21:2255-8 (2011) 
 
Inhibitor of nuclear factor kappa-B kinase subunit beta
Name:Inhibitor of nuclear factor kappa-B kinase subunit beta
Type:Serine/threonine-protein kinase
Mol. Mass.:86554.39
Organism:Homo sapiens (Human)
Description:GST-tagged IKK-2 was expressed in High Five cells and purified.
Residue:756
BDBM42616
NameBDBM42616
Synonyms:3-bromanyl-6,7,8,9-tetrahydro-5H-carbazole-1-carboxamide MLS000039236 cid_658319
TypeSmall organic molecule
Emp. Form.C13H13BrN2O
Mol. Mass.293.159
SMILESNC(=O)c1cc(Br)cc2c3CCCCc3[nH]c12