Reaction Details
TargetInhibitor of nuclear factor kappa-B kinase subunit beta
LigandBDBM50230828
Substrate/Competitorn/a
Meas. Tech.ChEMBL_741019 (CHEMBL1764205)
IC50 19.95±n/a nM
Citation Miller, DDBamborough, PChristopher, JABaldwin, IRChampigny, ACCutler, GJKerns, JKLongstaff, TMellor, GWMorey, JVMorse, MANie, HRumsey, WLTaggart, JJ 3,5-Disubstituted-indole-7-carboxamides: the discovery of a novel series of potent, selective inhibitors of IKK-ß. Bioorg Med Chem Lett21:2255-8 (2011) 
 
Inhibitor of nuclear factor kappa-B kinase subunit beta
Name:Inhibitor of nuclear factor kappa-B kinase subunit beta
Type:Serine/threonine-protein kinase
Mol. Mass.:86554.39
Organism:Homo sapiens (Human)
Description:GST-tagged IKK-2 was expressed in High Five cells and purified.
Residue:756
BDBM50230828
NameBDBM50230828
Synonyms:5-(4-fluorophenyl)-2-ureidothiophene-3-carboxamide [5-(p-fluorophenyl)-2-ureido]thiophene-3-carboxamide
TypeSmall organic molecule
Emp. Form.C12H10FN3O2S
Mol. Mass.279.29
SMILESNC(=O)Nc1sc(cc1C(N)=O)-c1ccc(F)cc1