Reaction Details
TargetInhibitor of nuclear factor kappa-B kinase subunit alpha
LigandBDBM50418173
Substrate/Competitorn/a
Meas. Tech.ChEMBL_741020 (CHEMBL1764206)
IC50 10000±n/a nM
Citation Miller, DDBamborough, PChristopher, JABaldwin, IRChampigny, ACCutler, GJKerns, JKLongstaff, TMellor, GWMorey, JVMorse, MANie, HRumsey, WLTaggart, JJ 3,5-Disubstituted-indole-7-carboxamides: the discovery of a novel series of potent, selective inhibitors of IKK-ß. Bioorg Med Chem Lett21:2255-8 (2011) 
 
Inhibitor of nuclear factor kappa-B kinase subunit alpha
Name:Inhibitor of nuclear factor kappa-B kinase subunit alpha
Type:PROTEIN
Mol. Mass.:84642.21
Organism:Homo sapiens (Human)
Description:ChEMBL_327453
Residue:745
BDBM50418173
NameBDBM50418173
Synonyms:CHEMBL1761500
TypeSmall organic molecule
Emp. Form.C16H11N3O
Mol. Mass.261.278
SMILESNC(=O)c1cc(cc2cc[nH]c12)-c1cccc(c1)C#N