Reaction Details
TargetInhibitor of nuclear factor kappa-B kinase subunit alpha
LigandBDBM50418181
Substrate/Competitorn/a
Meas. Tech.ChEMBL_741020 (CHEMBL1764206)
IC50 12589.25±n/a nM
Citation Miller, DDBamborough, PChristopher, JABaldwin, IRChampigny, ACCutler, GJKerns, JKLongstaff, TMellor, GWMorey, JVMorse, MANie, HRumsey, WLTaggart, JJ 3,5-Disubstituted-indole-7-carboxamides: the discovery of a novel series of potent, selective inhibitors of IKK-ß. Bioorg Med Chem Lett21:2255-8 (2011) 
 
Inhibitor of nuclear factor kappa-B kinase subunit alpha
Name:Inhibitor of nuclear factor kappa-B kinase subunit alpha
Type:PROTEIN
Mol. Mass.:84642.21
Organism:Homo sapiens (Human)
Description:ChEMBL_327453
Residue:745
BDBM50418181
NameBDBM50418181
Synonyms:CHEMBL1761508
TypeSmall organic molecule
Emp. Form.C15H13N3O2
Mol. Mass.267.2826
SMILESCOc1ccncc1-c1cc(C(N)=O)c2[nH]ccc2c1