Reaction Details
TargetCannabinoid receptor 1
LigandBDBM50418204
Substrate/Competitorn/a
Meas. Tech.ChEMBL_740403 (CHEMBL1764461)
IC50 9.33±n/a nM
Citation Cowley, PMBaker, JBuchanan, KICarlyle, IClark, JKClarkson, TRDeehan, MEdwards, DKiyoi, YMartin, IOsbourn, DWalker, GWard, NWishart, G Pharmacokinetic optimisation of novel indole-2-carboxamide cannabinoid CB1 antagonists. Bioorg Med Chem Lett21:2034-9 (2011) 
 
Cannabinoid receptor 1
Name:Cannabinoid receptor 1
Type:G Protein-Coupled Receptor (GPCR)
Mol. Mass.:52868.96
Organism:Homo sapiens (Human)
Description:P21554
Residue:472
BDBM50418204
NameBDBM50418204
Synonyms:CHEMBL1760670
TypeSmall organic molecule
Emp. Form.C21H20BrN3O3
Mol. Mass.442.306
SMILESCOc1ccc(Br)cc1Cn1c(cc2cc(ccc12)C#N)C(=O)NCCCO