Reaction Details
TargetCannabinoid receptor 1
LigandBDBM50418205
Substrate/Competitorn/a
Meas. Tech.ChEMBL_740403 (CHEMBL1764461)
IC50 2.63±n/a nM
Citation Cowley, PMBaker, JBuchanan, KICarlyle, IClark, JKClarkson, TRDeehan, MEdwards, DKiyoi, YMartin, IOsbourn, DWalker, GWard, NWishart, G Pharmacokinetic optimisation of novel indole-2-carboxamide cannabinoid CB1 antagonists. Bioorg Med Chem Lett21:2034-9 (2011) 
 
Cannabinoid receptor 1
Name:Cannabinoid receptor 1
Type:G Protein-Coupled Receptor (GPCR)
Mol. Mass.:52868.96
Organism:Homo sapiens (Human)
Description:P21554
Residue:472
BDBM50418205
NameBDBM50418205
Synonyms:CHEMBL1760669
TypeSmall organic molecule
Emp. Form.C24H22F3N3O3
Mol. Mass.457.445
SMILESOC1(CCNC(=O)c2cc3cc(ccc3n2Cc2cccc(OC(F)(F)F)c2)C#N)CCC1