Reaction Details
TargetCannabinoid receptor 1
LigandBDBM50418207
Substrate/Competitorn/a
Meas. Tech.ChEMBL_740403 (CHEMBL1764461)
IC50 6.03±n/a nM
Citation Cowley, PMBaker, JBuchanan, KICarlyle, IClark, JKClarkson, TRDeehan, MEdwards, DKiyoi, YMartin, IOsbourn, DWalker, GWard, NWishart, G Pharmacokinetic optimisation of novel indole-2-carboxamide cannabinoid CB1 antagonists. Bioorg Med Chem Lett21:2034-9 (2011) 
 
Cannabinoid receptor 1
Name:Cannabinoid receptor 1
Type:G Protein-Coupled Receptor (GPCR)
Mol. Mass.:52868.96
Organism:Homo sapiens (Human)
Description:P21554
Residue:472
BDBM50418207
NameBDBM50418207
Synonyms:CHEMBL1760667
TypeSmall organic molecule
Emp. Form.C23H16F9N3O3
Mol. Mass.553.3771
SMILESOC(CCNC(=O)c1cc2cc(ccc2n1Cc1cccc(OC(F)(F)F)c1)C#N)(C(F)(F)F)C(F)(F)F