Reaction Details
TargetCannabinoid receptor 1
LigandBDBM50418218
Substrate/Competitorn/a
Meas. Tech.ChEMBL_740403 (CHEMBL1764461)
IC50 5.13±n/a nM
Citation Cowley, PMBaker, JBuchanan, KICarlyle, IClark, JKClarkson, TRDeehan, MEdwards, DKiyoi, YMartin, IOsbourn, DWalker, GWard, NWishart, G Pharmacokinetic optimisation of novel indole-2-carboxamide cannabinoid CB1 antagonists. Bioorg Med Chem Lett21:2034-9 (2011) 
 
Cannabinoid receptor 1
Name:Cannabinoid receptor 1
Type:G Protein-Coupled Receptor (GPCR)
Mol. Mass.:52868.96
Organism:Homo sapiens (Human)
Description:P21554
Residue:472
BDBM50418218
NameBDBM50418218
Synonyms:CHEMBL1760656
TypeSmall organic molecule
Emp. Form.C24H22F3N3O4
Mol. Mass.473.4444
SMILESCOc1ccc(OC(F)(F)F)cc1Cn1c(cc2cc(ccc12)C#N)C(=O)NCC1(CO)CC1