Reaction Details
TargetCannabinoid receptor 2
LigandBDBM50418228
Substrate/Competitorn/a
Meas. Tech.ChEMBL_740402 (CHEMBL1764460)
Ki>10000±n/a nM
Citation Cowley, PMBaker, JBuchanan, KICarlyle, IClark, JKClarkson, TRDeehan, MEdwards, DKiyoi, YMartin, IOsbourn, DWalker, GWard, NWishart, G Pharmacokinetic optimisation of novel indole-2-carboxamide cannabinoid CB1 antagonists. Bioorg Med Chem Lett21:2034-9 (2011) 
 
Cannabinoid receptor 2
Name:Cannabinoid receptor 2
Type:G Protein-Coupled Receptor (GPCR)
Mol. Mass.:39690.94
Organism:Homo sapiens (Human)
Description:P34972
Residue:360
BDBM50418228
NameBDBM50418228
Synonyms:CHEMBL1760645
TypeSmall organic molecule
Emp. Form.C23H22F3N3O3
Mol. Mass.445.4343
SMILESCC(C)(CO)CNC(=O)c1cc2cc(ccc2n1Cc1cccc(OC(F)(F)F)c1)C#N