Reaction Details
TargetCoagulation factor X
LigandBDBM13288
Substrate/Competitorn/a
Meas. Tech.ChEMBL_743645 (CHEMBL1768188)
Ki 7.94±n/a nM
Citation Wawer, MBajorath, J Local structural changes, global data views: graphical substructure-activity relationship trailing. J Med Chem54:2944-51 (2011) 
 
Coagulation factor X
Name:Coagulation factor X
Type:Enzyme
Mol. Mass.:54726.60
Organism:Homo sapiens (Human)
Description:n/a
Residue:488
BDBM13288
NameBDBM13288
Synonyms:Sulfonamidopyrrolidinone 27 {4-(Aminoiminomethyl)-2-[3-(S)-(7-methoxynaphthalen-2-ylsulfonylamino)-2-oxopyrrolidin-1-ylmethyl]phenoxy}acetic Acid Methyl Ester
TypeSmall organic molecule
Emp. Form.C26H28N4O7S
Mol. Mass.540.588
SMILESCOC(=O)COc1ccc(cc1CN1CC[C@H](NS(=O)(=O)c2ccc3ccc(OC)cc3c2)C1=O)C(N)=N