Reaction Details
TargetCoagulation factor X
LigandBDBM13629
Substrate/Competitorn/a
Meas. Tech.ChEMBL_743645 (CHEMBL1768188)
Ki 79.43±n/a nM
Citation Wawer, MBajorath, J Local structural changes, global data views: graphical substructure-activity relationship trailing. J Med Chem54:2944-51 (2011) 
 
Coagulation factor X
Name:Coagulation factor X
Type:Enzyme
Mol. Mass.:54726.60
Organism:Homo sapiens (Human)
Description:n/a
Residue:488
BDBM13629
NameBDBM13629
Synonyms:3-Oxybenzamide 15 | 3-[2-(4-bromophenyl)ethoxy]-4-fluoro-N-{[1-(pyridin-4-yl)piperidin-4-yl]methyl}benzamide
TypeSmall organic molecule
Emp. Form.C26H27BrFN3O2
Mol. Mass.512.414
SMILESFc1ccc(cc1OCCc1ccc(Br)cc1)C(=O)NCC1CCN(CC1)c1ccncc1