Reaction Details
TargetCoagulation factor X
LigandBDBM50081006
Substrate/Competitorn/a
Meas. Tech.ChEMBL_743645 (CHEMBL1768188)
Ki 50.12±n/a nM
Citation Wawer, MBajorath, J Local structural changes, global data views: graphical substructure-activity relationship trailing. J Med Chem54:2944-51 (2011) 
 
Coagulation factor X
Name:Coagulation factor X
Type:Enzyme
Mol. Mass.:54726.60
Organism:Homo sapiens (Human)
Description:n/a
Residue:488
BDBM50081006
NameBDBM50081006
Synonyms:3-[3-((S)-7-Methoxy-naphthalene-2-sulfonylamino)-2-oxo-pyrrolidin-1-ylmethyl]-benzamidine | CHEMBL315699
TypeSmall organic molecule
Emp. Form.C23H24N4O4S
Mol. Mass.452.526
SMILESCOc1ccc2ccc(cc2c1)S(=O)(=O)NC1CCN(Cc2cccc(c2)C(N)=N)C1=O