Reaction Details
TargetfMet-Leu-Phe receptor
LigandBDBM50418351
Substrate/Competitorn/a
Meas. Tech.ChEMBL_744724 (CHEMBL1772745)
IC50 3981±n/a nM
Citation Unitt, JFagura, MPhillips, TKing, SPerry, MMorley, AMacDonald, CWeaver, RChristie, JBarber, SMohammed, RPaul, MCook, ABaxter, A Discovery of small molecule human FPR1 receptor antagonists. Bioorg Med Chem Lett21:2991-7 (2011) 
 
fMet-Leu-Phe receptor
Name:fMet-Leu-Phe receptor
Type:Enzyme Catalytic Domain
Mol. Mass.:38456.14
Organism:Homo sapiens (Human)
Description:gi_4503779
Residue:350
BDBM50418351
NameBDBM50418351
Synonyms:CHEMBL1770468
TypeSmall organic molecule
Emp. Form.C18H19N3O2S
Mol. Mass.341.427
SMILESCSCCC(NC(=O)c1ccccc1O)c1nc2ccccc2[nH]1