Reaction Details
TargetfMet-Leu-Phe receptor
LigandBDBM50418358
Substrate/Competitorn/a
Meas. Tech.ChEMBL_744724 (CHEMBL1772745)
IC50 5012±n/a nM
Citation Unitt, JFagura, MPhillips, TKing, SPerry, MMorley, AMacDonald, CWeaver, RChristie, JBarber, SMohammed, RPaul, MCook, ABaxter, A Discovery of small molecule human FPR1 receptor antagonists. Bioorg Med Chem Lett21:2991-7 (2011) 
 
fMet-Leu-Phe receptor
Name:fMet-Leu-Phe receptor
Type:Enzyme Catalytic Domain
Mol. Mass.:38456.14
Organism:Homo sapiens (Human)
Description:gi_4503779
Residue:350
BDBM50418358
NameBDBM50418358
Synonyms:CHEMBL1770303
TypeSmall organic molecule
Emp. Form.C21H17ClN2O3
Mol. Mass.380.824
SMILESOc1ccccc1C(=O)NC(C(=O)Nc1ccccc1)c1ccc(Cl)cc1